Reaction Details
TargetTyrosine-protein kinase ABL1
LigandBDBM50247712
Substrate/Competitorn/a
Meas. Tech.ChEMBL_496180 (CHEMBL1001092)
IC50 820±n/a nM
Citation Honda, TTerao, TAono, HBan, M Synthesis of novel 1,4-benzoxazin-3-one derivatives as inhibitors against tyrosine kinases. Bioorg Med Chem17:699-708 (2009) 
 
Tyrosine-protein kinase ABL1
Name:Tyrosine-protein kinase ABL1
Type:Enzyme
Mol. Mass.:122897.30
Organism:Homo sapiens (Human)
Description:P00519
Residue:1130
BDBM50247712
NameBDBM50247712
Synonyms:(E)-N-((2-Dimethylamino)ethyl)-3-(3-((Z)-4-methyl-3-oxo-3,4-dihydrobenzo[b][1,4]oxazin-2-ylidenemethyl)-thiophen-2-yl)acrylamide | CHEMBL455404
TypeSmall organic molecule
Emp. Form.C21H23N3O3S
Mol. Mass.397.491
SMILESCN(C)CCNC(=O)\C=C\c1ccc(\C=C2/Oc3ccccc3N(C)C2=O)s1