Reaction Details
TargetTyrosine-protein kinase ABL1
LigandBDBM50247766
Substrate/Competitorn/a
Meas. Tech.ChEMBL_496180 (CHEMBL1001092)
IC50 290±n/a nM
Citation Honda, TTerao, TAono, HBan, M Synthesis of novel 1,4-benzoxazin-3-one derivatives as inhibitors against tyrosine kinases. Bioorg Med Chem17:699-708 (2009) 
 
Tyrosine-protein kinase ABL1
Name:Tyrosine-protein kinase ABL1
Type:Enzyme
Mol. Mass.:122897.30
Organism:Homo sapiens (Human)
Description:P00519
Residue:1130
BDBM50247766
NameBDBM50247766
Synonyms:(E)-N-(4-(Morpholin-4-yl)phenyl)-3-(5-((Z)-3-oxo-3,4-dihydrobenzo[b][1,4]oxazin-2-ylidenemethyl)thiophen-2-yl)acrylamide | CHEMBL518031
TypeSmall organic molecule
Emp. Form.C26H23N3O4S
Mol. Mass.473.544
SMILESO=C(Nc1ccc(cc1)N1CCOCC1)\C=C\c1ccc(\C=C2/Oc3ccccc3NC2=O)s1