Reaction Details
TargetTyrosine-protein kinase ABL1
LigandBDBM50247728
Substrate/Competitorn/a
Meas. Tech.ChEMBL_496180 (CHEMBL1001092)
IC50 1900±n/a nM
Citation Honda, TTerao, TAono, HBan, M Synthesis of novel 1,4-benzoxazin-3-one derivatives as inhibitors against tyrosine kinases. Bioorg Med Chem17:699-708 (2009) 
 
Tyrosine-protein kinase ABL1
Name:Tyrosine-protein kinase ABL1
Type:Enzyme
Mol. Mass.:122897.30
Organism:Homo sapiens (Human)
Description:P00519
Residue:1130
BDBM50247728
NameBDBM50247728
Synonyms:(E)-3-(5-((Z)-4-Methyl-3-oxo-3,4-dihydrobenzo[b][1,4]oxazin-2-ylidenemethyl)thiophen-2-yl)-N-(pyridin-3-ylmethyl)acrylamide | CHEMBL461776
TypeSmall organic molecule
Emp. Form.C23H19N3O3S
Mol. Mass.417.48
SMILESCN1C(=O)\C(Oc2ccccc12)=C\c1ccc(\C=C\C(=O)NCc2cccnc2)s1