Reaction Details
TargetHistone deacetylase 6
LigandBDBM50255911
Substrate/Competitorn/a
Meas. Tech.ChEMBL_515267 (CHEMBL991291)
IC50 170±n/a nM
Citation Smil, DVManku, SChantigny, YALeit, SWahhab, AYan, TPFournel, MMaroun, CLi, ZLemieux, AMNicolescu, ARahil, JLefebvre, SPanetta, ABesterman, JMDéziel, R Novel HDAC6 isoform selective chiral small molecule histone deacetylase inhibitors. Bioorg Med Chem Lett19:688-92 (2009) 
 
Histone deacetylase 6
Name:Histone deacetylase 6
Type:Chromatin regulator; hydrolase; repressor
Mol. Mass.:131381.51
Organism:Homo sapiens (Human)
Description:Q9UBN7
Residue:1215
BDBM50255911
NameBDBM50255911
Synonyms:4-(((R)-2-benzyl-3,6-dioxopiperazin-1-yl)methyl)-N-hydroxybenzamide | CHEMBL481718
TypeSmall organic molecule
Emp. Form.C19H19N3O4
Mol. Mass.353.3719
SMILESONC(=O)c1ccc(CN2[C@H](Cc3ccccc3)C(=O)NCC2=O)cc1