Reaction Details
TargetHistone deacetylase 8
LigandBDBM50255095
Substrate/Competitorn/a
Meas. Tech.ChEMBL_515268 (CHEMBL991292)
IC50 210±n/a nM
Citation Smil, DVManku, SChantigny, YALeit, SWahhab, AYan, TPFournel, MMaroun, CLi, ZLemieux, AMNicolescu, ARahil, JLefebvre, SPanetta, ABesterman, JMDéziel, R Novel HDAC6 isoform selective chiral small molecule histone deacetylase inhibitors. Bioorg Med Chem Lett19:688-92 (2009) 
 
Histone deacetylase 8
Name:Histone deacetylase 8
Type:Enzyme
Mol. Mass.:41749.60
Organism:Homo sapiens (Human)
Description:Q9BY41
Residue:377
BDBM50255095
NameBDBM50255095
Synonyms:4-(((S)-3-benzyl-2,3-dihydro-2-oxoquinoxalin-4(1H)-yl)methyl)-N-hydroxybenzamide | CHEMBL516600
TypeSmall organic molecule
Emp. Form.C23H21N3O3
Mol. Mass.387.4311
SMILESONC(=O)c1ccc(CN2[C@@H](Cc3ccccc3)C(=O)Nc3ccccc23)cc1