Reaction Details
TargetHistone deacetylase 8
LigandBDBM50255853
Substrate/Competitorn/a
Meas. Tech.ChEMBL_515268 (CHEMBL991292)
IC50 640±n/a nM
Citation Smil, DVManku, SChantigny, YALeit, SWahhab, AYan, TPFournel, MMaroun, CLi, ZLemieux, AMNicolescu, ARahil, JLefebvre, SPanetta, ABesterman, JMDéziel, R Novel HDAC6 isoform selective chiral small molecule histone deacetylase inhibitors. Bioorg Med Chem Lett19:688-92 (2009) 
 
Histone deacetylase 8
Name:Histone deacetylase 8
Type:Enzyme
Mol. Mass.:41749.60
Organism:Homo sapiens (Human)
Description:Q9BY41
Residue:377
BDBM50255853
NameBDBM50255853
Synonyms:4-(((R)-2,3-dihydro-2-oxo-3-phenethylquinoxalin-4(1H)-yl)methyl)-N-hydroxybenzamide | CHEMBL482358
TypeSmall organic molecule
Emp. Form.C24H23N3O3
Mol. Mass.401.4577
SMILESONC(=O)c1ccc(CN2[C@H](CCc3ccccc3)C(=O)Nc3ccccc23)cc1