Reaction Details
TargetMacrophage colony-stimulating factor 1 receptor
LigandBDBM50255746
Substrate/Competitorn/a
Meas. Tech.ChEMBL_515273 (CHEMBL991297)
IC50 7±n/a nM
Citation Scott, DABalliet, CLCook, DJDavies, AMGero, TWOmer, CAPoondru, STheoclitou, METyurin, BZinda, MJ Identification of 3-amido-4-anilinoquinolines as potent and selective inhibitors of CSF-1R kinase. Bioorg Med Chem Lett19:697-700 (2009) 
 
Macrophage colony-stimulating factor 1 receptor
Name:Macrophage colony-stimulating factor 1 receptor
Type:Protein
Mol. Mass.:107979.48
Organism:Homo sapiens (Human)
Description:P07333
Residue:972
BDBM50255746
NameBDBM50255746
Synonyms:4-(2,4-difluorophenylamino)-7-methoxy-6-(2-morpholinoethylamino)quinoline-3-carboxamide | CHEMBL479446
TypeSmall organic molecule
Emp. Form.C23H25F2N5O3
Mol. Mass.457.4731
SMILESCOc1cc2ncc(C(N)=O)c(Nc3ccc(F)cc3F)c2cc1NCCN1CCOCC1