Reaction Details
Target5-hydroxytryptamine receptor 4
LigandBDBM50007872
Substrate/Competitorn/a
Meas. Tech.ChEMBL_515636 (CHEMBL1029728)
Ki 13±n/a nM
Citation Chu, WXu, JZhou, DZhang, FJones, LAWheeler, KTMach, RH New N-substituted 9-azabicyclo[3.3.1]nonan-3alpha-yl phenylcarbamate analogs as sigma2 receptor ligands: synthesis, in vitro characterization, and evaluation as PET imaging and chemosensitization agents. Bioorg Med Chem17:1222-31 (2009) 
 
5-hydroxytryptamine receptor 4
Name:5-hydroxytryptamine receptor 4
Type:Enzyme
Mol. Mass.:43767.54
Organism:Homo sapiens (Human)
Description:Q13639
Residue:388
BDBM50007872
NameBDBM50007872
Synonyms:3-Ethyl-2-oxo-2,3-dihydro-benzoimidazole-1-carboxylic acid (8-methyl-8-aza-bicyclo[3.2.1]oct-3-yl)-amide; hydrochloride CHEMBL544755 | CHEMBL62023
TypeSmall organic molecule
Emp. Form.C18H24N4O2
Mol. Mass.328.4088
SMILESCCn1c2ccccc2n(C(=O)NC2CC3CCC(C2)N3C)c1=O