Reaction Details
TargetCathepsin S
LigandBDBM50255570
Substrate/Competitorn/a
Meas. Tech.ChEMBL_515844 (CHEMBL1030543)
Ki 1.1±n/a nM
Citation Ayesa, SLindquist, CAgback, TBenkestock, KClasson, BHenderson, IHewitt, EJansson, KKallin, ASheppard, DSamuelsson, B Solid-phase parallel synthesis and SAR of 4-amidofuran-3-one inhibitors of cathepsin S: effect of sulfonamides P3 substituents on potency and selectivity. Bioorg Med Chem17:1307-24 (2009) 
 
Cathepsin S
Name:Cathepsin S
Type:Protein
Mol. Mass.:37507.38
Organism:Homo sapiens (Human)
Description:P25774
Residue:331
BDBM50255570
NameBDBM50255570
Synonyms:4-(4-Cyano-benzenesulfonylamino)-N-[1-(2S-ethyl-4-oxo-tetrahydro-furan-3S-ylcarbamoyl)-2S-(1-methyl-cyclopentyl)-ethyl]-benzamide | CHEMBL514195
TypeSmall organic molecule
Emp. Form.C29H34N4O6S
Mol. Mass.566.668
SMILESCC[C@@H]1OCC(=O)[C@H]1NC(=O)[C@H](CC1(C)CCCC1)NC(=O)c1ccc(NS(=O)(=O)c2ccc(cc2)C#N)cc1