Reaction Details
TargetCathepsin S
LigandBDBM50255848
Substrate/Competitorn/a
Meas. Tech.ChEMBL_515844 (CHEMBL1030543)
Ki 31±n/a nM
Citation Ayesa, SLindquist, CAgback, TBenkestock, KClasson, BHenderson, IHewitt, EJansson, KKallin, ASheppard, DSamuelsson, B Solid-phase parallel synthesis and SAR of 4-amidofuran-3-one inhibitors of cathepsin S: effect of sulfonamides P3 substituents on potency and selectivity. Bioorg Med Chem17:1307-24 (2009) 
 
Cathepsin S
Name:Cathepsin S
Type:Protein
Mol. Mass.:37507.38
Organism:Homo sapiens (Human)
Description:P25774
Residue:331
BDBM50255848
NameBDBM50255848
Synonyms:CHEMBL512367 | N-((S)-1-((2S,3S)-2-ethyl-4-oxotetrahydrofuran-3-ylamino)-4,4-dimethyl-1-oxopentan-2-yl)thiophene-3-carboxamide
TypeSmall organic molecule
Emp. Form.C18H26N2O4S
Mol. Mass.366.475
SMILESCC[C@@H]1OCC(=O)[C@H]1NC(=O)[C@H](CC(C)(C)C)NC(=O)c1ccsc1