Reaction Details
TargetCathepsin K
LigandBDBM50255297
Substrate/Competitorn/a
Meas. Tech.ChEMBL_515845 (CHEMBL1030544)
Ki 240±n/a nM
Citation Ayesa, SLindquist, CAgback, TBenkestock, KClasson, BHenderson, IHewitt, EJansson, KKallin, ASheppard, DSamuelsson, B Solid-phase parallel synthesis and SAR of 4-amidofuran-3-one inhibitors of cathepsin S: effect of sulfonamides P3 substituents on potency and selectivity. Bioorg Med Chem17:1307-24 (2009) 
 
Cathepsin K
Name:Cathepsin K
Type:Enzyme
Mol. Mass.:36975.68
Organism:Homo sapiens (Human)
Description:P43235
Residue:329
BDBM50255297
NameBDBM50255297
Synonyms:CHEMBL479461 | N-[1-(2S-Ethyl-4-oxo-tetrahydro-furan-3S-ylcarbamoyl)-2-(1-methyl-cyclopentyl)-ethyl]-4-methanesulfonylamino-3-methyl-benzamide
TypeSmall organic molecule
Emp. Form.C24H35N3O6S
Mol. Mass.493.616
SMILESCC[C@@H]1OCC(=O)[C@H]1NC(=O)[C@H](CC1(C)CCCC1)NC(=O)c1ccc(NS(C)(=O)=O)c(C)c1