Reaction Details
TargetTGF-beta receptor type-1
LigandBDBM50255909
Substrate/Competitorn/a
Meas. Tech.ChEMBL_516220 (CHEMBL985077)
EC50 344±n/a nM
Citation Bonafoux, DChuaqui, CBoriack-Sjodin, PAFitch, CHankins, GJosiah, SBlack, CHetu, GLing, LLee, WC 2-Aminoimidazoles inhibitors of TGF-beta receptor 1. Bioorg Med Chem Lett19:912-6 (2009) 
 
TGF-beta receptor type-1
Name:TGF-beta receptor type-1
Type:enzyme
Mol. Mass.:55968.24
Organism:Homo sapiens (Human)
Description:P36897
Residue:503
BDBM50255909
NameBDBM50255909
Synonyms:6-(4-(5-fluoro-6-methylpyridin-2-yl)-2-(4-methylpiperazin-1-yl)-1H-imidazol-5-yl)-[1,2,4]triazolo[1,5-a]pyridine | CHEMBL480581
TypeSmall organic molecule
Emp. Form.C20H21FN8
Mol. Mass.392.4327
SMILESCN1CCN(CC1)c1nc(c([nH]1)-c1ccc2ncnn2c1)-c1ccc(F)c(C)n1