Reaction Details
TargetProstaglandin G/H synthase 2
LigandBDBM50056999
Substrate/Competitorn/a
Meas. Tech.ChEMBL_516241 (CHEMBL985098)
IC50 3500±n/a nM
Citation Tributino, JLDuarte, CDCorrêa, RSDoriguetto, ACEllena, JRomeiro, NCCastro, NGMiranda, ALBarreiro, EJFraga, CA Novel 6-methanesulfonamide-3,4-methylenedioxyphenyl-N-acylhydrazones: orally effective anti-inflammatory drug candidates. Bioorg Med Chem17:1125-31 (2009) 
 
Prostaglandin G/H synthase 2
Name:Prostaglandin G/H synthase 2
Type:Enzyme
Mol. Mass.:69003.89
Organism:Homo sapiens (Human)
Description:Recombinant Cox-2 provided by Cayman (Cayman Chemical Co.,Ann Arbor, MI).
Residue:604
BDBM50056999
NameBDBM50056999
Synonyms:CHEMBL56367 | nimesulide
TypeSmall organic molecule
Emp. Form.C13H12N2O5S
Mol. Mass.308.31
SMILESCS(=O)(=O)Nc1ccc(cc1Oc1ccccc1)[N+]([O-])=O