Reaction Details
TargetE3 ubiquitin-protein ligase XIAP
LigandBDBM26223
Substrate/Competitorn/a
Meas. Tech.ChEMBL_516264 (CHEMBL985934)
Ki 14±n/a nM
Citation Sun, WNikolovska-Coleska, ZQin, DSun, HYang, CYBai, LQiu, SWang, YMa, DWang, S Design, synthesis, and evaluation of potent, nonpeptidic mimetics of second mitochondria-derived activator of caspases. J Med Chem52:593-6 (2009) 
 
E3 ubiquitin-protein ligase XIAP
Name:E3 ubiquitin-protein ligase XIAP
Type:Protein
Mol. Mass.:56685.27
Organism:Homo sapiens (Human)
Description:P98170
Residue:497
BDBM26223
NameBDBM26223
Synonyms:(3S,6S,10aS)-6-[(2S)-2-(methylamino)propanamido]-5-oxo-N-[(1R)-1,2,3,4-tetrahydronaphthalen-1-yl]-decahydropyrrolo[1,2-a]azocine-3-carboxamide bicyclic Smac peptide mimetic, 25
TypeSmall organic molecule
Emp. Form.C25H36N4O3
Mol. Mass.440.5783
SMILESCN[C@@H](C)C(=O)N[C@H]1CCCC[C@H]2CC[C@H](N2C1=O)C(=O)N[C@@H]1CCCc2ccccc12