Reaction Details
Target5-hydroxytryptamine receptor 1A
LigandBDBM50277129
Substrate/Competitorn/a
Meas. Tech.ChEMBL_540736 (CHEMBL1030618)
Ki 75.3±n/a nM
Citation Dounay, ABBarta, NSBikker, JABorosky, SACampbell, BMCrawford, TDenny, LEvans, LMGray, DLLee, PLenoir, EAXu, W Synthesis and pharmacological evaluation of aminopyrimidine series of 5-HT1A partial agonists. Bioorg Med Chem Lett19:1159-63 (2009) 
 
5-hydroxytryptamine receptor 1A
Name:5-hydroxytryptamine receptor 1A
Type:n/a
Mol. Mass.:46122.49
Organism:Homo sapiens (Human)
Description:n/a
Residue:422
BDBM50277129
NameBDBM50277129
Synonyms:(+/-)-4-(1-(2-(1H-indol-3-yl)ethyl)piperidin-3-yl)-N-cyclopropylpyrimidin-2-amine | CHEMBL473282
TypeSmall organic molecule
Emp. Form.C22H27N5
Mol. Mass.361.4833
SMILESC(Cc1c[nH]c2ccccc12)N1CCCC(C1)c1ccnc(NC2CC2)n1