Reaction Details
Target5-hydroxytryptamine receptor 1A
LigandBDBM50277214
Substrate/Competitorn/a
Meas. Tech.ChEMBL_540736 (CHEMBL1030618)
Ki 780±n/a nM
Citation Dounay, ABBarta, NSBikker, JABorosky, SACampbell, BMCrawford, TDenny, LEvans, LMGray, DLLee, PLenoir, EAXu, W Synthesis and pharmacological evaluation of aminopyrimidine series of 5-HT1A partial agonists. Bioorg Med Chem Lett19:1159-63 (2009) 
 
5-hydroxytryptamine receptor 1A
Name:5-hydroxytryptamine receptor 1A
Type:n/a
Mol. Mass.:46122.49
Organism:Homo sapiens (Human)
Description:n/a
Residue:422
BDBM50277214
NameBDBM50277214
Synonyms:CHEMBL475092 | N-cyclopropyl-4-(1-(2-(thiazol-4-yl)ethyl)piperidin-3-yl)pyrimidin-2-amine
TypeSmall organic molecule
Emp. Form.C17H23N5S
Mol. Mass.329.463
SMILESC(Cc1cscn1)N1CCCC(C1)c1ccnc(NC2CC2)n1