Reaction Details
TargetD(4) dopamine receptor
LigandBDBM50277005
Substrate/Competitorn/a
Meas. Tech.ChEMBL_541031 (CHEMBL1024731)
Ki 18.6±n/a nM
Citation Sikazwe, DMNkansah, NTAltundas, RZhu, XYRoth, BLSetola, VAblordeppey, SY Synthesis and evaluation of ligands for D2-like receptors: the role of common pharmacophoric groups. Bioorg Med Chem17:1716-23 (2009) 
 
D(4) dopamine receptor
Name:D(4) dopamine receptor
Type:Enzyme
Mol. Mass.:48373.19
Organism:Homo sapiens (Human)
Description:P21917
Residue:419
BDBM50277005
NameBDBM50277005
Synonyms:3-{[4-(4-Chlorophenyl)-1,4-diazepan-1-yl]methyl}-1Hpyrrolo[2,3-b]pyridine | CHEMBL460223
TypeSmall organic molecule
Emp. Form.C19H21ClN4
Mol. Mass.340.85
SMILESClc1ccc(cc1)N1CCCN(Cc2c[nH]c3ncccc23)CC1