Reaction Details
TargetMu-type opioid receptor
LigandBDBM50276498
Substrate/Competitorn/a
Meas. Tech.ChEMBL_540959 (CHEMBL1030679)
IC50 351±n/a nM
Citation Dockendorff, CJin, SOlsen, MLautens, MCoupal, MHodzic, LSpear, NPayza, KWalpole, CTomaszewski, MJ Discovery of mu-opioid selective ligands derived from 1-aminotetralin scaffolds made via metal-catalyzed ring-opening reactions. Bioorg Med Chem Lett19:1228-32 (2009) 
 
Mu-type opioid receptor
Name:Mu-type opioid receptor
Type:G Protein-Coupled Receptor (GPCR)
Mol. Mass.:44789.51
Organism:Homo sapiens (Human)
Description:P35372
Residue:400
BDBM50276498
NameBDBM50276498
Synonyms:(+/-)-3,4-dichloro-N-(2-(dimethylamino)-6,7-dimethoxy-1,2,3,4-tetrahydronaphthalen-1-yl)-N-(2-methoxyethyl)benzamide | CHEMBL461258
TypeSmall organic molecule
Emp. Form.C24H30Cl2N2O4
Mol. Mass.481.412
SMILESCOCCN(C1C(CCc2cc(OC)c(OC)cc12)N(C)C)C(=O)c1ccc(Cl)c(Cl)c1