Reaction Details
TargetMu-type opioid receptor
LigandBDBM50276446
Substrate/Competitorn/a
Meas. Tech.ChEMBL_540962 (CHEMBL1028119)
EC50>90000±n/a nM
Citation Dockendorff, CJin, SOlsen, MLautens, MCoupal, MHodzic, LSpear, NPayza, KWalpole, CTomaszewski, MJ Discovery of mu-opioid selective ligands derived from 1-aminotetralin scaffolds made via metal-catalyzed ring-opening reactions. Bioorg Med Chem Lett19:1228-32 (2009) 
 
Mu-type opioid receptor
Name:Mu-type opioid receptor
Type:G Protein-Coupled Receptor (GPCR)
Mol. Mass.:44789.51
Organism:Homo sapiens (Human)
Description:P35372
Residue:400
BDBM50276446
NameBDBM50276446
Synonyms:(+/-)-2-(4-chlorophenyl)-N-(2-methoxyethyl)-N-(2-(4-phenylpiperazin-1-yl)-1,2-dihydronaphthalen-1-yl)acetamide | CHEMBL459784
TypeSmall organic molecule
Emp. Form.C31H34ClN3O2
Mol. Mass.516.074
SMILESCOCCN(C1C(C=Cc2ccccc12)N1CCN(CC1)c1ccccc1)C(=O)Cc1ccc(Cl)cc1