Reaction Details
TargetMu-type opioid receptor
LigandBDBM50276495
Substrate/Competitorn/a
Meas. Tech.ChEMBL_540959 (CHEMBL1030679)
IC50 100±n/a nM
Citation Dockendorff, CJin, SOlsen, MLautens, MCoupal, MHodzic, LSpear, NPayza, KWalpole, CTomaszewski, MJ Discovery of mu-opioid selective ligands derived from 1-aminotetralin scaffolds made via metal-catalyzed ring-opening reactions. Bioorg Med Chem Lett19:1228-32 (2009) 
 
Mu-type opioid receptor
Name:Mu-type opioid receptor
Type:G Protein-Coupled Receptor (GPCR)
Mol. Mass.:44789.51
Organism:Homo sapiens (Human)
Description:P35372
Residue:400
BDBM50276495
NameBDBM50276495
Synonyms:(+/-)-3-chloro-N-(2-methoxyethyl)-N-(2-(4-phenylpiperazin-1-yl)-1,2-dihydronaphthalen-1-yl)thiophene-2-carboxamide | CHEMBL460631
TypeSmall organic molecule
Emp. Form.C28H30ClN3O2S
Mol. Mass.508.075
SMILESCOCCN(C1C(C=Cc2ccccc12)N1CCN(CC1)c1ccccc1)C(=O)c1sccc1Cl