Reaction Details
TargetKappa-type opioid receptor
LigandBDBM50276409
Substrate/Competitorn/a
Meas. Tech.ChEMBL_540960 (CHEMBL1030680)
IC50 707±n/a nM
Citation Dockendorff, CJin, SOlsen, MLautens, MCoupal, MHodzic, LSpear, NPayza, KWalpole, CTomaszewski, MJ Discovery of mu-opioid selective ligands derived from 1-aminotetralin scaffolds made via metal-catalyzed ring-opening reactions. Bioorg Med Chem Lett19:1228-32 (2009) 
 
Kappa-type opioid receptor
Name:Kappa-type opioid receptor
Type:G Protein-Coupled Receptor (GPCR)
Mol. Mass.:42648.76
Organism:Homo sapiens (Human)
Description:P41145
Residue:380
BDBM50276409
NameBDBM50276409
Synonyms:(1S,2S)-N-(2-methoxyethyl)-2-(thiophen-3-yl)-1,2,3,4-tetrahydronaphthalen-1-amine | CHEMBL512394
TypeSmall organic molecule
Emp. Form.C17H21NOS
Mol. Mass.287.42
SMILESCOCCN[C@H]1[C@@H](CCc2ccccc12)c1ccsc1