Reaction Details
TargetKappa-type opioid receptor
LigandBDBM50276412
Substrate/Competitorn/a
Meas. Tech.ChEMBL_540960 (CHEMBL1030680)
IC50>10000±n/a nM
Citation Dockendorff, CJin, SOlsen, MLautens, MCoupal, MHodzic, LSpear, NPayza, KWalpole, CTomaszewski, MJ Discovery of mu-opioid selective ligands derived from 1-aminotetralin scaffolds made via metal-catalyzed ring-opening reactions. Bioorg Med Chem Lett19:1228-32 (2009) 
 
Kappa-type opioid receptor
Name:Kappa-type opioid receptor
Type:G Protein-Coupled Receptor (GPCR)
Mol. Mass.:42648.76
Organism:Homo sapiens (Human)
Description:P41145
Residue:380
BDBM50276412
NameBDBM50276412
Synonyms:(+/-)-3,4-dichloro-N-(2-methoxyethyl)-N-(2-(4-phenylpiperazin-1-yl)-1,2-dihydronaphthalen-1-yl)benzamide | CHEMBL460832
TypeSmall organic molecule
Emp. Form.C30H31Cl2N3O2
Mol. Mass.536.492
SMILESCOCCN(C1C(C=Cc2ccccc12)N1CCN(CC1)c1ccccc1)C(=O)c1ccc(Cl)c(Cl)c1