Reaction Details
TargetKappa-type opioid receptor
LigandBDBM50276496
Substrate/Competitorn/a
Meas. Tech.ChEMBL_540960 (CHEMBL1030680)
IC50 1324±n/a nM
Citation Dockendorff, CJin, SOlsen, MLautens, MCoupal, MHodzic, LSpear, NPayza, KWalpole, CTomaszewski, MJ Discovery of mu-opioid selective ligands derived from 1-aminotetralin scaffolds made via metal-catalyzed ring-opening reactions. Bioorg Med Chem Lett19:1228-32 (2009) 
 
Kappa-type opioid receptor
Name:Kappa-type opioid receptor
Type:G Protein-Coupled Receptor (GPCR)
Mol. Mass.:42648.76
Organism:Homo sapiens (Human)
Description:P41145
Residue:380
BDBM50276496
NameBDBM50276496
Synonyms:3-chloro-N-(2-methoxyethyl)-N-((1R,2R)-2-(4-phenylpiperazin-1-yl)-1,2-dihydronaphthalen-1-yl)thiophene-2-carboxamide | CHEMBL461050
TypeSmall organic molecule
Emp. Form.C28H30ClN3O2S
Mol. Mass.508.075
SMILESCOCCN([C@H]1[C@@H](C=Cc2ccccc12)N1CCN(CC1)c1ccccc1)C(=O)c1sccc1Cl