Reaction Details
TargetAdenosine receptor A2a
LigandBDBM50248265
Substrate/Competitorn/a
Meas. Tech.ChEMBL_543474 (CHEMBL1018640)
Ki 76±n/a nM
Citation Shao, YCole, AGBrescia, MRQin, LYDuo, JStauffer, TMRokosz, LLMcGuinness, BFHenderson, I Synthesis and SAR studies of trisubstituted purinones as potent and selective adenosine A2A receptor antagonists. Bioorg Med Chem Lett19:1399-402 (2009) 
 
Adenosine receptor A2a
Name:Adenosine receptor A2a
Type:G Protein-Coupled Receptor (GPCR)
Mol. Mass.:44716.46
Organism:Homo sapiens (Human)
Description:P29274
Residue:412
BDBM50248265
NameBDBM50248265
Synonyms:2-(cyclopropylamino)-9-(3,5-dimethoxyphenyl)-7-(2-methoxybenzyl)-7H-purin-8(9H)-one | CHEMBL515877
TypeSmall organic molecule
Emp. Form.C24H25N5O4
Mol. Mass.447.4864
SMILESCOc1cc(OC)cc(c1)-n1c2nc(NC3CC3)ncc2n(Cc2ccccc2OC)c1=O