Reaction Details
TargetAdenosine receptor A2a
LigandBDBM50248381
Substrate/Competitorn/a
Meas. Tech.ChEMBL_543474 (CHEMBL1018640)
Ki 86±n/a nM
Citation Shao, YCole, AGBrescia, MRQin, LYDuo, JStauffer, TMRokosz, LLMcGuinness, BFHenderson, I Synthesis and SAR studies of trisubstituted purinones as potent and selective adenosine A2A receptor antagonists. Bioorg Med Chem Lett19:1399-402 (2009) 
 
Adenosine receptor A2a
Name:Adenosine receptor A2a
Type:G Protein-Coupled Receptor (GPCR)
Mol. Mass.:44716.46
Organism:Homo sapiens (Human)
Description:P29274
Residue:412
BDBM50248381
NameBDBM50248381
Synonyms:7-(2-chlorobenzyl)-2-(cyclopropylamino)-9-(3-methoxyphenyl)-7H-purin-8(9H)-one | CHEMBL489120
TypeSmall organic molecule
Emp. Form.C22H20ClN5O2
Mol. Mass.421.88
SMILESCOc1cccc(c1)-n1c2nc(NC3CC3)ncc2n(Cc2ccccc2Cl)c1=O