Reaction Details
TargetAdenosine receptor A2a
LigandBDBM50248479
Substrate/Competitorn/a
Meas. Tech.ChEMBL_543474 (CHEMBL1018640)
Ki 31±n/a nM
Citation Shao, YCole, AGBrescia, MRQin, LYDuo, JStauffer, TMRokosz, LLMcGuinness, BFHenderson, I Synthesis and SAR studies of trisubstituted purinones as potent and selective adenosine A2A receptor antagonists. Bioorg Med Chem Lett19:1399-402 (2009) 
 
Adenosine receptor A2a
Name:Adenosine receptor A2a
Type:G Protein-Coupled Receptor (GPCR)
Mol. Mass.:44716.46
Organism:Homo sapiens (Human)
Description:P29274
Residue:412
BDBM50248479
NameBDBM50248479
Synonyms:7-(2,6-difluorobenzyl)-2-(ethylamino)-9-(3-methoxyphenyl)-7H-purin-8(9H)-one | CHEMBL491318
TypeSmall organic molecule
Emp. Form.C21H19F2N5O2
Mol. Mass.411.4047
SMILESCCNc1ncc2n(Cc3c(F)cccc3F)c(=O)n(-c3cccc(OC)c3)c2n1