Reaction Details
TargetAdenosine receptor A2a
LigandBDBM50247934
Substrate/Competitorn/a
Meas. Tech.ChEMBL_543474 (CHEMBL1018640)
Ki 9±n/a nM
Citation Shao, YCole, AGBrescia, MRQin, LYDuo, JStauffer, TMRokosz, LLMcGuinness, BFHenderson, I Synthesis and SAR studies of trisubstituted purinones as potent and selective adenosine A2A receptor antagonists. Bioorg Med Chem Lett19:1399-402 (2009) 
 
Adenosine receptor A2a
Name:Adenosine receptor A2a
Type:G Protein-Coupled Receptor (GPCR)
Mol. Mass.:44716.46
Organism:Homo sapiens (Human)
Description:P29274
Residue:412
BDBM50247934
NameBDBM50247934
Synonyms:7-(2,6-difluorobenzyl)-9-(3-methoxyphenyl)-2-(2-(thiophen-2-yl)ethylamino)-7H-purin-8(9H)-one | CHEMBL522268
TypeSmall organic molecule
Emp. Form.C25H21F2N5O2S
Mol. Mass.493.528
SMILESCOc1cccc(c1)-n1c2nc(NCCc3cccs3)ncc2n(Cc2c(F)cccc2F)c1=O