Reaction Details
TargetAdenosine receptor A1
LigandBDBM50248317
Substrate/Competitorn/a
Meas. Tech.ChEMBL_543475 (CHEMBL1018641)
Ki 599±n/a nM
Citation Shao, YCole, AGBrescia, MRQin, LYDuo, JStauffer, TMRokosz, LLMcGuinness, BFHenderson, I Synthesis and SAR studies of trisubstituted purinones as potent and selective adenosine A2A receptor antagonists. Bioorg Med Chem Lett19:1399-402 (2009) 
 
Adenosine receptor A1
Name:Adenosine receptor A1
Type:G Protein-Coupled Receptor (GPCR)
Mol. Mass.:36520.92
Organism:Homo sapiens (Human)
Description:P30542
Residue:326
BDBM50248317
NameBDBM50248317
Synonyms:2-(cyclopropylamino)-9-(3-fluorophenyl)-7-(2-methoxybenzyl)-7H-purin-8(9H)-one | CHEMBL474747
TypeSmall organic molecule
Emp. Form.C22H20FN5O2
Mol. Mass.405.4249
SMILESCOc1ccccc1Cn1c2cnc(NC3CC3)nc2n(-c2cccc(F)c2)c1=O