Reaction Details
TargetPotassium voltage-gated channel subfamily KQT member 1
LigandBDBM50279719
Substrate/Competitorn/a
Meas. Tech.ChEMBL_545265 (CHEMBL1020711)
IC50 330±n/a nM
Citation Du, LLi, MYang, QTang, YYou, QXia, L Molecular hybridization, synthesis, and biological evaluation of novel chroman I(Kr) and I(Ks) dual blockers. Bioorg Med Chem Lett19:1477-80 (2009) 
 
Potassium voltage-gated channel subfamily KQT member 1
Name:Potassium voltage-gated channel subfamily KQT member 1
Type:PROTEIN
Mol. Mass.:74450.11
Organism:Cavia porcellus
Description:ChEMBL_88894
Residue:671
BDBM50279719
NameBDBM50279719
Synonyms:1-(2,3-dihydro-6-amidecarboxylchromen-4-ylideneamino)-3-(4-(4-methylpiperazin-1-yl)butyl)imidazolidine-2,4-dione | CHEMBL474106
TypeSmall organic molecule
Emp. Form.C22H30N6O4
Mol. Mass.442.5114
SMILESCN1CCN(CCCCn2c(O)cn(N=C3CCOc4ccc(cc34)C(N)=O)c2=O)CC1