Reaction Details
TargetPotassium voltage-gated channel subfamily KQT member 1
LigandBDBM50279471
Substrate/Competitorn/a
Meas. Tech.ChEMBL_545265 (CHEMBL1020711)
IC50 5.8±n/a nM
Citation Du, LLi, MYang, QTang, YYou, QXia, L Molecular hybridization, synthesis, and biological evaluation of novel chroman I(Kr) and I(Ks) dual blockers. Bioorg Med Chem Lett19:1477-80 (2009) 
 
Potassium voltage-gated channel subfamily KQT member 1
Name:Potassium voltage-gated channel subfamily KQT member 1
Type:PROTEIN
Mol. Mass.:74450.11
Organism:Cavia porcellus
Description:ChEMBL_88894
Residue:671
BDBM50279471
NameBDBM50279471
Synonyms:1-(2,3-dihydro-6-chlorochromen-4-ylideneamino)-3-(3-(4-methylpiperazin-1-yl)propyl)imidazolidine-2,4-dione | CHEMBL484801
TypeSmall organic molecule
Emp. Form.C20H26ClN5O3
Mol. Mass.419.905
SMILESCN1CCN(CCCn2c(O)cn(N=C3CCOc4ccc(Cl)cc34)c2=O)CC1