Reaction Details
TargetMelatonin receptor type 1B
LigandBDBM50266405
Substrate/Competitorn/a
Meas. Tech.ChEMBL_517311 (CHEMBL1031364)
Ki 0.11±n/a nM
Citation Zlotos, DPAttia, MIJulius, JSethi, SWitt-Enderby, PA 2-[(2,3-dihydro-1H-indol-1-yl)methyl]melatonin analogues: a novel class of MT2-selective melatonin receptor antagonists. J Med Chem52:826-33 (2009) 
 
Melatonin receptor type 1B
Name:Melatonin receptor type 1B
Type:Enzyme
Mol. Mass.:40203.54
Organism:Homo sapiens (Human)
Description:P49286
Residue:362
BDBM50266405
NameBDBM50266405
Synonyms:CHEMBL457128 | N-(3-(3-methoxyphenyl)-3-(naphthalen-2-yl)propyl)acetamide
TypeSmall organic molecule
Emp. Form.C22H23NO2
Mol. Mass.333.4235
SMILESCOc1cccc(c1)C(CCNC(C)=O)c1ccc2ccccc2c1