Reaction Details
Target5-hydroxytryptamine receptor 3A
LigandBDBM50413331
Substrate/Competitorn/a
Meas. Tech.ChEMBL_566267 (CHEMBL953570)
IC50 100000±n/a nM
Citation Enz, AFeuerbach, DFrederiksen, MUGentsch, CHurth, KMüller, WNozulak, JRoy, BL Gamma-lactams--a novel scaffold for highly potent and selective alpha 7 nicotinic acetylcholine receptor agonists. Bioorg Med Chem Lett19:1287-91 (2009) 
 
5-hydroxytryptamine receptor 3A
Name:5-hydroxytryptamine receptor 3A
Type:Protein
Mol. Mass.:55283.27
Organism:Homo sapiens (Human)
Description:P46098
Residue:478
BDBM50413331
NameBDBM50413331
Synonyms:CHEMBL459900
TypeSmall organic molecule
Emp. Form.C21H24N2O2
Mol. Mass.336.4275
SMILESCN1C(CC(CN2CCCCC2)C1=O)C#Cc1ccc2occc2c1