Reaction Details
TargetAurora kinase B
LigandBDBM50248464
Substrate/Competitorn/a
Meas. Tech.ChEMBL_566617 (CHEMBL960143)
IC50 920±n/a nM
Citation Tasler, SMüller, OWieber, THerz, TKrauss, RTotzke, FKubbutat, MHSchächtele, C N-substituted 2'-(aminoaryl)benzothiazoles as kinase inhibitors: hit identification and scaffold hopping. Bioorg Med Chem Lett19:1349-56 (2009) 
 
Aurora kinase B
Name:Aurora kinase B
Type:Protein
Mol. Mass.:39327.72
Organism:Homo sapiens (Human)
Description:Q96GD4
Residue:344
BDBM50248464
NameBDBM50248464
Synonyms:CHEMBL491677 | N-[4-(isoindolin-2-yl)phenyl]-6',7'-dimethoxyquinazolin-4'-amine
TypeSmall organic molecule
Emp. Form.C24H22N4O2
Mol. Mass.398.4571
SMILESCOc1cc2ncnc(Nc3ccc(cc3)N3Cc4ccccc4C3)c2cc1OC