Reaction Details
TargetAurora kinase B
LigandBDBM50248229
Substrate/Competitorn/a
Meas. Tech.ChEMBL_566617 (CHEMBL960143)
IC50 290±n/a nM
Citation Tasler, SMüller, OWieber, THerz, TKrauss, RTotzke, FKubbutat, MHSchächtele, C N-substituted 2'-(aminoaryl)benzothiazoles as kinase inhibitors: hit identification and scaffold hopping. Bioorg Med Chem Lett19:1349-56 (2009) 
 
Aurora kinase B
Name:Aurora kinase B
Type:Protein
Mol. Mass.:39327.72
Organism:Homo sapiens (Human)
Description:Q96GD4
Residue:344
BDBM50248229
NameBDBM50248229
Synonyms:CHEMBL474347 | N-(4-(benzo[d]thiazol-2-yl)-2-fluorophenyl)thieno[3,2-d]pyrimidin-4-amine
TypeSmall organic molecule
Emp. Form.C19H11FN4S2
Mol. Mass.378.446
SMILESFc1cc(ccc1Nc1ncnc2ccsc12)-c1nc2ccccc2s1