Reaction Details
TargetEpidermal growth factor receptor
LigandBDBM50248232
Substrate/Competitorn/a
Meas. Tech.ChEMBL_566606 (CHEMBL964945)
IC50 800±n/a nM
Citation Tasler, SMüller, OWieber, THerz, TKrauss, RTotzke, FKubbutat, MHSchächtele, C N-substituted 2'-(aminoaryl)benzothiazoles as kinase inhibitors: hit identification and scaffold hopping. Bioorg Med Chem Lett19:1349-56 (2009) 
 
Epidermal growth factor receptor
Name:Epidermal growth factor receptor
Type:Receptor Kinase Domain
Mol. Mass.:134279.59
Organism:Homo sapiens (Human)
Description:P00533
Residue:1210
BDBM50248232
NameBDBM50248232
Synonyms:CHEMBL514016 | N-(4-(benzo[d]thiazol-2-yl)-3-chlorophenyl)-7-chloroquinazolin-4-amine
TypeSmall organic molecule
Emp. Form.C21H12Cl2N4S
Mol. Mass.423.318
SMILESClc1ccc2c(Nc3ccc(-c4nc5ccccc5s4)c(Cl)c3)ncnc2c1