Reaction Details
TargetEphrin type-B receptor 4
LigandBDBM50248414
Substrate/Competitorn/a
Meas. Tech.ChEMBL_566612 (CHEMBL964951)
IC50 780±n/a nM
Citation Tasler, SMüller, OWieber, THerz, TKrauss, RTotzke, FKubbutat, MHSchächtele, C N-substituted 2'-(aminoaryl)benzothiazoles as kinase inhibitors: hit identification and scaffold hopping. Bioorg Med Chem Lett19:1349-56 (2009) 
 
Ephrin type-B receptor 4
Name:Ephrin type-B receptor 4
Type:Enzyme
Mol. Mass.:108273.51
Organism:Homo sapiens (Human)
Description:P54760
Residue:987
BDBM50248414
NameBDBM50248414
Synonyms:CHEMBL522785 | N4-(3-(benzo[d]thiazol-2-yl)phenyl)-6,7-dimethoxy-N2-(5-methyl-1H-pyrazol-3-yl)quinazoline-2,4-diamine
TypeSmall organic molecule
Emp. Form.C27H23N7O2S
Mol. Mass.509.582
SMILESCOc1cc2nc(Nc3cc(C)n[nH]3)nc(Nc3cccc(c3)-c3nc4ccccc4s3)c2cc1OC