Reaction Details
TargetAurora kinase A
LigandBDBM50248147
Substrate/Competitorn/a
Meas. Tech.ChEMBL_566616 (CHEMBL960142)
IC50 320±n/a nM
Citation Tasler, SMüller, OWieber, THerz, TKrauss, RTotzke, FKubbutat, MHSchächtele, C N-substituted 2'-(aminoaryl)benzothiazoles as kinase inhibitors: hit identification and scaffold hopping. Bioorg Med Chem Lett19:1349-56 (2009) 
 
Aurora kinase A
Name:Aurora kinase A
Type:Serine/threonine-protein kinase
Mol. Mass.:45830.98
Organism:Homo sapiens (Human)
Description:O14965
Residue:403
BDBM50248147
NameBDBM50248147
Synonyms:CHEMBL461110 | N2-(4-(benzo[d]thiazol-2-yl)-3-methoxyphenyl)-N4-(5-methyl-1H-pyrazol-3-yl)pyrimidine-2,4-diamine
TypeSmall organic molecule
Emp. Form.C22H19N7OS
Mol. Mass.429.498
SMILESCOc1cc(Nc2nccc(Nc3cc(C)n[nH]3)n2)ccc1-c1nc2ccccc2s1