Reaction Details
TargetReceptor tyrosine-protein kinase erbB-2
LigandBDBM4626
Substrate/Competitorn/a
Meas. Tech.ChEMBL_566618 (CHEMBL960144)
IC50 24±n/a nM
Citation Tasler, SMüller, OWieber, THerz, TKrauss, RTotzke, FKubbutat, MHSchächtele, C N-substituted 2'-(aminoaryl)benzothiazoles as kinase inhibitors: hit identification and scaffold hopping. Bioorg Med Chem Lett19:1349-56 (2009) 
 
Receptor tyrosine-protein kinase erbB-2
Name:Receptor tyrosine-protein kinase erbB-2
Type:n/a
Mol. Mass.:137894.47
Organism:Homo sapiens (Human)
Description:P04626
Residue:1255
BDBM4626
NameBDBM4626
Synonyms:Anilinoquinazoline deriv. 9 N-(3-chloro-4-fluorophenyl)-6,7-dimethoxyquinazolin-4-amine
TypeSmall organic molecule
Emp. Form.C16H13ClFN3O2
Mol. Mass.333.745
SMILESCOc1cc2ncnc(Nc3ccc(F)c(Cl)c3)c2cc1OC