Reaction Details
TargetHepatocyte growth factor receptor
LigandBDBM50248047
Substrate/Competitorn/a
Meas. Tech.ChEMBL_566634 (CHEMBL960948)
IC50 35±n/a nM
Citation Raeppel, SClaridge, SSaavedra, OGaudette, FZhan, LMannion, MZhou, NRaeppel, FGranger, MCIsakovic, LDéziel, RNguyen, HBeaulieu, NBeaulieu, CDupont, IRobert, MFLefebvre, SDubay, MRahil, JWang, JSte-Croix, HRobert Macleod, ABesterman, JVaisburg, A N-(3-fluoro-4-(2-arylthieno[3,2-b]pyridin-7-yloxy)phenyl)-2-oxo-3-phenylimidazolidine-1-carboxamides: a novel series of dual c-Met/VEGFR2 receptor tyrosine kinase inhibitors. Bioorg Med Chem Lett19:1323-8 (2009) 
 
Hepatocyte growth factor receptor
Name:Hepatocyte growth factor receptor
Type:Protein
Mol. Mass.:155559.73
Organism:Homo sapiens (Human)
Description:P08581
Residue:1390
BDBM50248047
NameBDBM50248047
Synonyms:CHEMBL503524 | N-(3-fluoro-4-(2-(1-(2-(pyrrolidin-1-yl)ethyl)-1H-imidazol-4-yl)thieno[3,2-b]pyridin-7-yloxy)phenyl)-2-oxo-3-phenylimidazolidine-1-carboxamide
TypeSmall organic molecule
Emp. Form.C32H30FN7O3S
Mol. Mass.611.689
SMILESFc1cc(NC(=O)N2CCN(C2=O)c2ccccc2)ccc1Oc1ccnc2cc(sc12)-c1cn(CCN2CCCC2)cn1