Reaction Details
TargetVascular endothelial growth factor receptor 2
LigandBDBM50248051
Substrate/Competitorn/a
Meas. Tech.ChEMBL_566632 (CHEMBL960946)
IC50 11±n/a nM
Citation Raeppel, SClaridge, SSaavedra, OGaudette, FZhan, LMannion, MZhou, NRaeppel, FGranger, MCIsakovic, LDéziel, RNguyen, HBeaulieu, NBeaulieu, CDupont, IRobert, MFLefebvre, SDubay, MRahil, JWang, JSte-Croix, HRobert Macleod, ABesterman, JVaisburg, A N-(3-fluoro-4-(2-arylthieno[3,2-b]pyridin-7-yloxy)phenyl)-2-oxo-3-phenylimidazolidine-1-carboxamides: a novel series of dual c-Met/VEGFR2 receptor tyrosine kinase inhibitors. Bioorg Med Chem Lett19:1323-8 (2009) 
 
Vascular endothelial growth factor receptor 2
Name:Vascular endothelial growth factor receptor 2
Type:Receptor Tyrosine Kinase
Mol. Mass.:151510.97
Organism:Homo sapiens (Human)
Description:P35968
Residue:1356
BDBM50248051
NameBDBM50248051
Synonyms:CHEMBL448276 | N-(3-fluoro-4-(2-(4-(piperazin-1-ylmethyl)phenyl)thieno[3,2-b]pyridin-7-yloxy)phenyl)-2-oxo-3-phenylimidazolidine-1-carboxamide
TypeSmall organic molecule
Emp. Form.C34H31FN6O3S
Mol. Mass.622.712
SMILESFc1cc(NC(=O)N2CCN(C2=O)c2ccccc2)ccc1Oc1ccnc2cc(sc12)-c1ccc(CN2CCNCC2)cc1