Reaction Details
TargetHepatocyte growth factor receptor
LigandBDBM50248056
Substrate/Competitorn/a
Meas. Tech.ChEMBL_566630 (CHEMBL960944)
IC50 230±n/a nM
Citation Raeppel, SClaridge, SSaavedra, OGaudette, FZhan, LMannion, MZhou, NRaeppel, FGranger, MCIsakovic, LDéziel, RNguyen, HBeaulieu, NBeaulieu, CDupont, IRobert, MFLefebvre, SDubay, MRahil, JWang, JSte-Croix, HRobert Macleod, ABesterman, JVaisburg, A N-(3-fluoro-4-(2-arylthieno[3,2-b]pyridin-7-yloxy)phenyl)-2-oxo-3-phenylimidazolidine-1-carboxamides: a novel series of dual c-Met/VEGFR2 receptor tyrosine kinase inhibitors. Bioorg Med Chem Lett19:1323-8 (2009) 
 
Hepatocyte growth factor receptor
Name:Hepatocyte growth factor receptor
Type:Protein
Mol. Mass.:155559.73
Organism:Homo sapiens (Human)
Description:P08581
Residue:1390
BDBM50248056
NameBDBM50248056
Synonyms:(S)-N-(4-(2-(3-(dimethylamino)pyrrolidine-1-carbonyl)thieno[3,2-b]pyridin-7-yloxy)-3-fluorophenyl)-2-oxo-3-phenylimidazolidine-1-carboxamide | CHEMBL502621
TypeSmall organic molecule
Emp. Form.C30H29FN6O4S
Mol. Mass.588.652
SMILESCN(C)[C@H]1CCN(C1)C(=O)c1cc2nccc(Oc3ccc(NC(=O)N4CCN(C4=O)c4ccccc4)cc3F)c2s1