Reaction Details
TargetHepatocyte growth factor receptor
LigandBDBM4814
Substrate/Competitorn/a
Meas. Tech.ChEMBL_566631 (CHEMBL960945)
IC50>5000±n/a nM
Citation Raeppel, SClaridge, SSaavedra, OGaudette, FZhan, LMannion, MZhou, NRaeppel, FGranger, MCIsakovic, LDéziel, RNguyen, HBeaulieu, NBeaulieu, CDupont, IRobert, MFLefebvre, SDubay, MRahil, JWang, JSte-Croix, HRobert Macleod, ABesterman, JVaisburg, A N-(3-fluoro-4-(2-arylthieno[3,2-b]pyridin-7-yloxy)phenyl)-2-oxo-3-phenylimidazolidine-1-carboxamides: a novel series of dual c-Met/VEGFR2 receptor tyrosine kinase inhibitors. Bioorg Med Chem Lett19:1323-8 (2009) 
 
Hepatocyte growth factor receptor
Name:Hepatocyte growth factor receptor
Type:Protein
Mol. Mass.:155559.73
Organism:Homo sapiens (Human)
Description:P08581
Residue:1390
BDBM4814
NameBDBM4814
Synonyms:CHEMBL535 N-[2-(diethylamino)ethyl]-5-{[(3Z)-5-fluoro-2-oxo-2,3-dihydro-1H-indol-3-ylidene]methyl}-2,4-dimethyl-1H-pyrrole-3-carboxamide SUNITINIB US10464902, Sunitinib US9163010, Sunitinib | US9914707, SU11248
TypeSmall organic molecule
Emp. Form.C22H27FN4O2
Mol. Mass.398.4738
SMILESCCN(CC)CCNC(=O)c1c(C)[nH]c(\C=C2/C(=O)Nc3ccc(F)cc23)c1C