Reaction Details
TargetCannabinoid receptor 1
LigandBDBM50248604
Substrate/Competitorn/a
Meas. Tech.ChEMBL_562315 (CHEMBL1015289)
Ki 27±n/a nM
Citation Bhattacharjee, HGurley, SNMoore, BM Design and synthesis of novel tri-aryl CB2 selective cannabinoid ligands. Bioorg Med Chem Lett19:1691-3 (2009) 
 
Cannabinoid receptor 1
Name:Cannabinoid receptor 1
Type:G Protein-Coupled Receptor (GPCR)
Mol. Mass.:52868.96
Organism:Homo sapiens (Human)
Description:P21554
Residue:472
BDBM50248604
NameBDBM50248604
Synonyms:(3',5'-dichloro-2,6-dihydroxybiphenyl-4-yl)(phenyl)methanone US9139546, 28
TypeSmall organic molecule
Emp. Form.C19H12Cl2O3
Mol. Mass.359.203
SMILESOc1cc(cc(O)c1-c1cc(Cl)cc(Cl)c1)C(=O)c1ccccc1