Reaction Details
TargetCannabinoid receptor 1
LigandBDBM50248603
Substrate/Competitorn/a
Meas. Tech.ChEMBL_562315 (CHEMBL1015289)
Ki>1000±n/a nM
Citation Bhattacharjee, HGurley, SNMoore, BM Design and synthesis of novel tri-aryl CB2 selective cannabinoid ligands. Bioorg Med Chem Lett19:1691-3 (2009) 
 
Cannabinoid receptor 1
Name:Cannabinoid receptor 1
Type:G Protein-Coupled Receptor (GPCR)
Mol. Mass.:52868.96
Organism:Homo sapiens (Human)
Description:P21554
Residue:472
BDBM50248603
NameBDBM50248603
Synonyms:(3',5'-dichloro-2,6-dimethoxybiphenyl-4-yl)(phenyl)methanol US9139546, 15
TypeSmall organic molecule
Emp. Form.C21H18Cl2O3
Mol. Mass.389.272
SMILESCOc1cc(cc(OC)c1-c1cc(Cl)cc(Cl)c1)C(O)c1ccccc1