Reaction Details
TargetNitric oxide synthase, inducible
LigandBDBM21959
Substrate/Competitorn/a
Meas. Tech.ChEMBL_563975 (CHEMBL955235)
Kd 7000±n/a nM
Citation Martin, NIWoodward, JJWinter, MBMarletta, MA 4,4-Difluorinated analogues of l-arginine and N(G)-hydroxy-l-arginine as mechanistic probes for nitric oxide synthase. Bioorg Med Chem Lett19:1758-62 (2009) 
 
Nitric oxide synthase, inducible
Name:Nitric oxide synthase, inducible
Type:Homodimer
Mol. Mass.:131141.95
Organism:Homo sapiens (Human)
Description:P35228
Residue:1153
BDBM21959
NameBDBM21959
Synonyms:(2S)-2-amino-5-carbamimidamidopentanoic acid CHEMBL1485 | L-arginine
TypeAmino Acid
Emp. Form.C6H14N4O2
Mol. Mass.174.201
SMILES[#7]-[#6@@H](-[#6]-[#6]-[#6]\[#7]=[#6](/[#7])-[#7])-[#6](-[#8])=O