Reaction Details
TargetP2X purinoceptor 3
LigandBDBM50413352
Substrate/Competitorn/a
Meas. Tech.ChEMBL_562361 (CHEMBL1017975)
IC50 50±n/a nM
Citation Jahangir, AAlam, MCarter, DSDillon, MPBois, DJFord, APGever, JRLin, CWagner, PJZhai, YZira, J Identification and SAR of novel diaminopyrimidines. Part 2: The discovery of RO-51, a potent and selective, dual P2X(3)/P2X(2/3) antagonist for the treatment of pain. Bioorg Med Chem Lett19:1632-5 (2009) 
 
P2X purinoceptor 3
Name:P2X purinoceptor 3
Type:Enzyme Catalytic Domain
Mol. Mass.:44397.63
Organism:RAT
Description:Purinergic, P2X3 0 RAT::P49654
Residue:397
BDBM50413352
NameBDBM50413352
Synonyms:CHEMBL443930
TypeSmall organic molecule
Emp. Form.C15H19IN4O2
Mol. Mass.414.2414
SMILESCNc1ncc(Oc2cc(I)c(OC)cc2C(C)C)c(N)n1