Reaction Details
TargetP2X purinoceptor 2
LigandBDBM50413356
Substrate/Competitorn/a
Meas. Tech.ChEMBL_562362 (CHEMBL1017976)
IC50 40±n/a nM
Citation Jahangir, AAlam, MCarter, DSDillon, MPBois, DJFord, APGever, JRLin, CWagner, PJZhai, YZira, J Identification and SAR of novel diaminopyrimidines. Part 2: The discovery of RO-51, a potent and selective, dual P2X(3)/P2X(2/3) antagonist for the treatment of pain. Bioorg Med Chem Lett19:1632-5 (2009) 
 
P2X purinoceptor 2
Name:P2X purinoceptor 2
Type:Enzyme Catalytic Domain
Mol. Mass.:51765.18
Organism:Homo sapiens (Human)
Description:PurinergicP2X2/3 0 HUMAN::Q9UBL9
Residue:471
BDBM50413356
NameBDBM50413356
Synonyms:CHEMBL492933
TypeSmall organic molecule
Emp. Form.C18H24IN5O3
Mol. Mass.485.3193
SMILESCOc1cc(C(C)C)c(Oc2cnc(NCCNC(C)=O)nc2N)cc1I