Reaction Details
TargetP2X purinoceptor 3
LigandBDBM50413391
Substrate/Competitorn/a
Meas. Tech.ChEMBL_565941 (CHEMBL960836)
IC50 126±n/a nM
Citation Carter, DSAlam, MCai, HDillon, MPFord, APGever, JRJahangir, ALin, CMoore, AGWagner, PJZhai, Y Identification and SAR of novel diaminopyrimidines. Part 1: The discovery of RO-4, a dual P2X(3)/P2X(2/3) antagonist for the treatment of pain. Bioorg Med Chem Lett19:1628-31 (2009) 
 
P2X purinoceptor 3
Name:P2X purinoceptor 3
Type:Enzyme Catalytic Domain
Mol. Mass.:44397.63
Organism:RAT
Description:Purinergic, P2X3 0 RAT::P49654
Residue:397
BDBM50413391
NameBDBM50413391
Synonyms:CHEMBL494772
TypeSmall organic molecule
Emp. Form.C16H22N4O2
Mol. Mass.302.3715
SMILESCOc1cc(Cc2cnc(N)nc2N)c(cc1OC)C(C)C