Reaction Details
TargetP2X purinoceptor 2
LigandBDBM50413384
Substrate/Competitorn/a
Meas. Tech.ChEMBL_565944 (CHEMBL960839)
IC50<10000±n/a nM
Citation Carter, DSAlam, MCai, HDillon, MPFord, APGever, JRJahangir, ALin, CMoore, AGWagner, PJZhai, Y Identification and SAR of novel diaminopyrimidines. Part 1: The discovery of RO-4, a dual P2X(3)/P2X(2/3) antagonist for the treatment of pain. Bioorg Med Chem Lett19:1628-31 (2009) 
 
P2X purinoceptor 2
Name:P2X purinoceptor 2
Type:Enzyme Catalytic Domain
Mol. Mass.:51765.18
Organism:Homo sapiens (Human)
Description:PurinergicP2X2/3 0 HUMAN::Q9UBL9
Residue:471
BDBM50413384
NameBDBM50413384
Synonyms:CHEMBL510124
TypeSmall organic molecule
Emp. Form.C16H22N4O2
Mol. Mass.302.3715
SMILESCCc1cc(OC)c(OC)cc1CCc1cnc(N)nc1N