Reaction Details
TargetP2X purinoceptor 2
LigandBDBM50413382
Substrate/Competitorn/a
Meas. Tech.ChEMBL_565944 (CHEMBL960839)
IC50 501±n/a nM
Citation Carter, DSAlam, MCai, HDillon, MPFord, APGever, JRJahangir, ALin, CMoore, AGWagner, PJZhai, Y Identification and SAR of novel diaminopyrimidines. Part 1: The discovery of RO-4, a dual P2X(3)/P2X(2/3) antagonist for the treatment of pain. Bioorg Med Chem Lett19:1628-31 (2009) 
 
P2X purinoceptor 2
Name:P2X purinoceptor 2
Type:Enzyme Catalytic Domain
Mol. Mass.:51765.18
Organism:Homo sapiens (Human)
Description:PurinergicP2X2/3 0 HUMAN::Q9UBL9
Residue:471
BDBM50413382
NameBDBM50413382
Synonyms:CHEMBL494833
TypeSmall organic molecule
Emp. Form.C15H20N4O3
Mol. Mass.304.3443
SMILESCOc1cc(Oc2cnc(N)nc2N)c(cc1OC)C(C)C